Target
Peroxisome proliferator-activated receptor gamma
Ligand
BDBM50374786
Substrate
Meas. Tech.
ChEMBL_469931 (CHEMBL938400)
EC50
815±n/a nM
Citation
 Shen, LZhang, YWang, ASieber-McMaster, EChen, XPelton, PXu, JZYang, MZhu, PZhou, LReuman, MHu, ZRussell, RGibbs, ACRoss, HDemarest, KMurray, WVKuo, GH Synthesis and structure-activity relationships of thiadiazole-derivatives as potent and orally active peroxisome proliferator-activated receptors alpha/delta dual agonists. Bioorg Med Chem 16:3321-41 (2008)  
Target
Name:
Peroxisome proliferator-activated receptor gamma
Synonyms:
NR1C3 PPAR-gamma PPARG_HUMAN Peroxisome proliferator-activated receptor gamma (PPAR gamma) Peroxisome proliferator-activated receptor gamma (PPARĪ³) peroxisome proliferator-activated receptor gamma isoform 2
Type:
Nuclear Receptor
Mol. Mass.:
57613.46
Organism:
Homo sapiens (Human)
Description:
P37231
Residue:
505
  
Inhibitor
Name:
BDBM50374786
Synonyms:
CHEMBL259973
Type:
Small organic molecule
Emp. Form.:
C21H20Cl2N2O3S2
Mol. Mass.:
483.431
SMILES:
Cc1cc(SCCc2nc(ns2)-c2ccc(Cl)c(Cl)c2)ccc1OC(C)(C)C(O)=O
: