Target
Peroxisome proliferator-activated receptor gamma
Ligand
BDBM28755
Substrate
Meas. Tech.
ChEMBL_469931 (CHEMBL938400)
EC50
>3000±n/a nM
Citation
 Shen, LZhang, YWang, ASieber-McMaster, EChen, XPelton, PXu, JZYang, MZhu, PZhou, LReuman, MHu, ZRussell, RGibbs, ACRoss, HDemarest, KMurray, WVKuo, GH Synthesis and structure-activity relationships of thiadiazole-derivatives as potent and orally active peroxisome proliferator-activated receptors alpha/delta dual agonists. Bioorg Med Chem 16:3321-41 (2008)  
Target
Name:
Peroxisome proliferator-activated receptor gamma
Synonyms:
NR1C3 PPAR-gamma PPARG_HUMAN Peroxisome proliferator-activated receptor gamma (PPAR gamma) Peroxisome proliferator-activated receptor gamma (PPARĪ³) peroxisome proliferator-activated receptor gamma isoform 2
Type:
Nuclear Receptor
Mol. Mass.:
57613.46
Organism:
Homo sapiens (Human)
Description:
P37231
Residue:
505
  
Inhibitor
Name:
BDBM28755
Synonyms:
2-methyl-2-{2-methyl-4-[({5-[4-(trifluoromethoxy)phenyl]-1,2,4-thiadiazol-3-yl}methyl)sulfanyl]phenoxy}propanoic acid | reverse-[1,2,4]thiadiazole derivative, 45
Type:
Small organic molecule
Emp. Form.:
C21H19F3N2O4S2
Mol. Mass.:
484.512
SMILES:
Cc1cc(SCc2nsc(n2)-c2ccc(OC(F)(F)F)cc2)ccc1OC(C)(C)C(O)=O
: