Target
Peroxisome proliferator-activated receptor alpha
Ligand
BDBM50374778
Substrate
Meas. Tech.
ChEMBL_469927 (CHEMBL938396)
EC50
1290±n/a nM
Citation
 Shen, LZhang, YWang, ASieber-McMaster, EChen, XPelton, PXu, JZYang, MZhu, PZhou, LReuman, MHu, ZRussell, RGibbs, ACRoss, HDemarest, KMurray, WVKuo, GH Synthesis and structure-activity relationships of thiadiazole-derivatives as potent and orally active peroxisome proliferator-activated receptors alpha/delta dual agonists. Bioorg Med Chem 16:3321-41 (2008)  
Target
Name:
Peroxisome proliferator-activated receptor alpha
Synonyms:
NR1C1 PPAR PPAR-alpha PPARA_HUMAN Peroxisome proliferator-activated receptor | Peroxisome proliferator-activated receptor alpha (PPAR alpha)
Type:
Enzyme
Mol. Mass.:
52222.08
Organism:
Homo sapiens (Human)
Description:
Q07869
Residue:
468
  
Inhibitor
Name:
BDBM50374778
Synonyms:
CHEMBL265421
Type:
Small organic molecule
Emp. Form.:
C20H16F3NO3S2
Mol. Mass.:
439.471
SMILES:
Cc1cc(SCc2cc(ns2)-c2ccc(cc2)C(F)(F)F)ccc1OCC(O)=O
: