Target
Peroxisome proliferator-activated receptor alpha
Ligand
BDBM50374780
Substrate
Meas. Tech.
ChEMBL_469927 (CHEMBL938396)
EC50
155±n/a nM
Citation
 Shen, LZhang, YWang, ASieber-McMaster, EChen, XPelton, PXu, JZYang, MZhu, PZhou, LReuman, MHu, ZRussell, RGibbs, ACRoss, HDemarest, KMurray, WVKuo, GH Synthesis and structure-activity relationships of thiadiazole-derivatives as potent and orally active peroxisome proliferator-activated receptors alpha/delta dual agonists. Bioorg Med Chem 16:3321-41 (2008)  
Target
Name:
Peroxisome proliferator-activated receptor alpha
Synonyms:
NR1C1 PPAR PPAR-alpha PPARA_HUMAN Peroxisome proliferator-activated receptor | Peroxisome proliferator-activated receptor alpha (PPAR alpha)
Type:
Enzyme
Mol. Mass.:
52222.08
Organism:
Homo sapiens (Human)
Description:
Q07869
Residue:
468
  
Inhibitor
Name:
BDBM50374780
Synonyms:
CHEMBL260627
Type:
Small organic molecule
Emp. Form.:
C19H15F3N2O3S2
Mol. Mass.:
440.459
SMILES:
CC(Oc1ccc(SCc2nc(ns2)-c2ccc(cc2)C(F)(F)F)cc1)C(O)=O
: