Target
Peroxisome proliferator-activated receptor alpha
Ligand
BDBM50374782
Substrate
Meas. Tech.
ChEMBL_469927 (CHEMBL938396)
EC50
643±n/a nM
Citation
 Shen, LZhang, YWang, ASieber-McMaster, EChen, XPelton, PXu, JZYang, MZhu, PZhou, LReuman, MHu, ZRussell, RGibbs, ACRoss, HDemarest, KMurray, WVKuo, GH Synthesis and structure-activity relationships of thiadiazole-derivatives as potent and orally active peroxisome proliferator-activated receptors alpha/delta dual agonists. Bioorg Med Chem 16:3321-41 (2008)  
Target
Name:
Peroxisome proliferator-activated receptor alpha
Synonyms:
NR1C1 PPAR PPAR-alpha PPARA_HUMAN Peroxisome proliferator-activated receptor | Peroxisome proliferator-activated receptor alpha (PPAR alpha)
Type:
Enzyme
Mol. Mass.:
52222.08
Organism:
Homo sapiens (Human)
Description:
Q07869
Residue:
468
  
Inhibitor
Name:
BDBM50374782
Synonyms:
CHEMBL260839
Type:
Small organic molecule
Emp. Form.:
C22H24N2O4S
Mol. Mass.:
412.502
SMILES:
Cc1ccc(cc1C)-c1nsc(COc2ccc(OC(C)(C)C(O)=O)c(C)c2)n1
: