Target
Peroxisome proliferator-activated receptor alpha
Ligand
BDBM28757
Substrate
Meas. Tech.
ChEMBL_469927 (CHEMBL938396)
EC50
94±n/a nM
Citation
 Shen, LZhang, YWang, ASieber-McMaster, EChen, XPelton, PXu, JZYang, MZhu, PZhou, LReuman, MHu, ZRussell, RGibbs, ACRoss, HDemarest, KMurray, WVKuo, GH Synthesis and structure-activity relationships of thiadiazole-derivatives as potent and orally active peroxisome proliferator-activated receptors alpha/delta dual agonists. Bioorg Med Chem 16:3321-41 (2008)  
Target
Name:
Peroxisome proliferator-activated receptor alpha
Synonyms:
NR1C1 PPAR PPAR-alpha PPARA_HUMAN Peroxisome proliferator-activated receptor | Peroxisome proliferator-activated receptor alpha (PPAR alpha)
Type:
Enzyme
Mol. Mass.:
52222.08
Organism:
Homo sapiens (Human)
Description:
Q07869
Residue:
468
  
Inhibitor
Name:
BDBM28757
Synonyms:
2-methyl-2-[2-methyl-4-({3-[4-(trifluoromethoxy)phenyl]-1,2,4-thiadiazol-5-yl}methoxy)phenoxy]propanoic acid | oxygen-link [1,2,4]thiadiazole derivative, 51
Type:
Small organic molecule
Emp. Form.:
C21H19F3N2O5S
Mol. Mass.:
468.446
SMILES:
Cc1cc(OCc2nc(ns2)-c2ccc(OC(F)(F)F)cc2)ccc1OC(C)(C)C(O)=O
: