Target
Calcium/calmodulin-dependent protein kinase type II subunit delta
Ligand
BDBM50375066
Substrate
Meas. Tech.
ChEMBL_470254 (CHEMBL950209)
IC50
280±n/a nM
Citation
 Lu, QChen, ZPerumattam, JWang, DXLiang, WXu, YJDo, SBonaga, LHigaki, JDong, HLiclican, ASideris, SLaney, MDugar, SMavunkel, BLevy, DE Aryl-indolyl maleimides as inhibitors of CaMKIIdelta. Part 3: Importance of the indole orientation. Bioorg Med Chem Lett 18:2399-403 (2008)  
Target
Name:
Calcium/calmodulin-dependent protein kinase type II subunit delta
Synonyms:
CAMK2D CaM kinase II CaMK-II subunit delta Calcium/calmodulin-dependent protein kinase type II subunit delta (CAMK2D) KCC2D_HUMAN
Type:
Enzyme Catalytic Domain
Mol. Mass.:
56419.78
Organism:
Homo sapiens (Human)
Description:
Q13557
Residue:
499
  
Inhibitor
Name:
BDBM50375066
Synonyms:
CHEMBL256460
Type:
Small organic molecule
Emp. Form.:
C25H23N5O3
Mol. Mass.:
441.4818
SMILES:
CNCCc1cn(C2=C(C(=O)NC2=O)c2c[nH]c3ccc(cc23)C(=O)NC)c2ccccc12
: