Target
Mu-type opioid receptor
Ligand
BDBM50375296
Substrate
Meas. Tech.
ChEMBL_470717 (CHEMBL934558)
IC50
129.1±n/a nM
Citation
 Salvadori, SFiorini, STrapella, CPorreca, FDavis, PSasaki, YAmbo, AMarczak, EDLazarus, LHBalboni, G Role of benzimidazole (Bid) in the delta-opioid agonist pseudopeptide H-Dmt-Tic-NH-CH(2)-Bid (UFP-502). Bioorg Med Chem 16:3032-8 (2008)  
Target
Name:
Mu-type opioid receptor
Synonyms:
M-OR-1 Mu opioid receptor OPIATE Mu OPRM_CAVPO
Type:
Enzyme Catalytic Domain
Mol. Mass.:
11165.58
Organism:
GUINEA PIG
Description:
P97266
Residue:
98
  
Inhibitor
Name:
BDBM50375296
Synonyms:
CHEMBL258704
Type:
Small organic molecule
Emp. Form.:
C29H30N4O3S
Mol. Mass.:
514.639
SMILES:
Cc1cc(O)cc(C)c1C[C@H](N)C(=O)N1Cc2ccccc2C[C@H]1C(=O)NCc1nc2ccccc2s1
: