Target
Lanosterol 14-alpha demethylase
Ligand
BDBM50375303
Substrate
Meas. Tech.
ChEMBL_470779 (CHEMBL934981)
IC50
800±n/a nM
Citation
 Ekins, SMankowski, DCHoover, DJLawton, MPTreadway, JLHarwood, HJ Three-dimensional quantitative structure-activity relationship analysis of human CYP51 inhibitors. Drug Metab Dispos 35:493-500 (2007)  
Target
Name:
Lanosterol 14-alpha demethylase
Synonyms:
CP51A_HUMAN CYP51A1 Cytochrome P450 51 LDM P450-14DM P450LI Sterol 14-alpha demethylase
Type:
Protein
Mol. Mass.:
56817.21
Organism:
Homo sapiens (Human)
Description:
Q16850
Residue:
503
  
Inhibitor
Name:
BDBM50375303
Synonyms:
CHEMBL259552
Type:
Small organic molecule
Emp. Form.:
C23H23ClFN3O3
Mol. Mass.:
443.898
SMILES:
OC1CCN(CC1)C(=O)[C@H](Cc1ccccc1F)NC(=O)c1cc2cc(Cl)ccc2[nH]1
: