Target
Mitogen-activated protein kinase 1
Ligand
BDBM50375649
Substrate
Meas. Tech.
ChEMBL_473591 (CHEMBL939356)
Kd
5000±n/a nM
Citation
 Fedorov, OMarsden, BPogacic, VRellos, PMüller, SBullock, ANSchwaller, JSundström, MKnapp, S A systematic interaction map of validated kinase inhibitors with Ser/Thr kinases. Proc Natl Acad Sci U S A 104:20523-8 (2007)  
Target
Name:
Mitogen-activated protein kinase 1
Synonyms:
ERK2 Extracellular signal-regulated kinase 2 Extracellular signal-regulated kinase 2 (ERK2) MAPK 2 MK01_HUMAN Mitogen-activated protein kinase 1 (ERK-2) Mitogen-activated protein kinase 2 PRKM2 | p42-MAPK
Type:
Ser/Thr Protein Kinase
Mol. Mass.:
41392.76
Organism:
Homo sapiens (Human)
Description:
P28482
Residue:
360
  
Inhibitor
Name:
BDBM50375649
Synonyms:
CHEMBL262615
Type:
Small organic molecule
Emp. Form.:
C14H16N2O3S
Mol. Mass.:
292.353
SMILES:
CCOc1ccc(\C=C2\SC(=O)N(CCN)C2=O)cc1
: