Target
Geranylgeranyl pyrophosphate synthase BTS1
Ligand
BDBM25308
Substrate
Meas. Tech.
ChEMBL_474166 (CHEMBL938424)
Ki
130±n/a nM
Citation
 Guo, RTCao, RLiang, PHKo, TPChang, THHudock, MPJeng, WYChen, CKZhang, YSong, YKuo, CJYin, FOldfield, EWang, AH Bisphosphonates target multiple sites in both cis- and trans-prenyltransferases. Proc Natl Acad Sci U S A 104:10022-7 (2007)  
Target
Name:
Geranylgeranyl pyrophosphate synthase BTS1
Synonyms:
BTS1 Geranylgeranyl diphosphate synthase (GGPPS) | Geranylgeranyl pyrophosphate synthase
Type:
Protein
Mol. Mass.:
38647.44
Organism:
Saccharomyces cerevisiae (Yeast)
Description:
Residue:
335
  
Inhibitor
Name:
BDBM25308
Synonyms:
(1-hydroxy-2-{imidazo[1,2-a]pyridin-3-yl}-1-phosphonoethyl)phosphonic acid | bisphosphonate, 57
Type:
Small organic molecule
Emp. Form.:
C9H12N2O7P2
Mol. Mass.:
322.1483
SMILES:
OC(Cc1cnc2ccccn12)(P(O)(O)=O)P(O)(O)=O
: