Target
Mitogen-activated protein kinase 14
Ligand
BDBM50376434
Substrate
Meas. Tech.
ChEMBL_476693 (CHEMBL933483)
Ki
0.46±n/a nM
Citation
 Wrobleski, STLin, SHynes, JWu, HPitt, SShen, DRZhang, RGillooly, KMShuster, DJMcIntyre, KWDoweyko, AMKish, KFTredup, JADuke, GJSack, JSMcKinnon, MDodd, JBarrish, JCSchieven, GLLeftheris, K Synthesis and SAR of new pyrrolo[2,1-f][1,2,4]triazines as potent p38 alpha MAP kinase inhibitors. Bioorg Med Chem Lett 18:2739-44 (2008)  
Target
Name:
Mitogen-activated protein kinase 14
Synonyms:
CSAID-binding protein CSBP1 CSPB1 MAP kinase 14 MAP kinase p38 alpha MAPK14 MK14_HUMAN Mitogen-activated protein kinase p38 alpha Stress-activated protein kinase 2a | p38 MAP kinase alpha/beta
Type:
Serine/threonine-protein kinase
Mol. Mass.:
41286.76
Organism:
Homo sapiens (Human)
Description:
Q16539
Residue:
360
  
Inhibitor
Name:
BDBM50376434
Synonyms:
CHEMBL408150
Type:
Small organic molecule
Emp. Form.:
C34H35N7O3
Mol. Mass.:
589.6868
SMILES:
C[C@H](NC(=O)c1cn2ncnc(Nc3cc(NC(=O)c4cccc(c4)N4CCOCC4)ccc3C)c2c1C)c1ccccc1
: