Target
Transient receptor potential cation channel subfamily A member 1
Ligand
BDBM50203072
Substrate
Meas. Tech.
ChEMBL_477125 (CHEMBL940160)
EC50
33500±n/a nM
Citation
 Macpherson, LJDubin, AEEvans, MJMarr, FSchultz, PGCravatt, BFPatapoutian, A Noxious compounds activate TRPA1 ion channels through covalent modification of cysteines. Nature 445:541-545 (2007)  
Target
Name:
Transient receptor potential cation channel subfamily A member 1
Synonyms:
ANKTM1 TRPA1 Transformation-sensitive protein p120 | Transient receptor potential cation channel subfamily A member 1 (TRPA1)
Type:
Protein
Mol. Mass.:
127514.20
Organism:
Homo sapiens (Human)
Description:
O75762
Residue:
1119
  
Inhibitor
Name:
BDBM50203072
Synonyms:
3-isothiocyanatoprop-1-ene Allylisothiocyanate | CHEMBL233248
Type:
Small organic molecule
Emp. Form.:
C4H5NS
Mol. Mass.:
99.154
SMILES:
C=CCN=C=S
: