Target
Cannabinoid receptor 2
Ligand
BDBM50364081
Substrate
Meas. Tech.
ChEMBL_477389 (CHEMBL928177)
EC50
0.3±n/a nM
Citation
 Verbist, BMDe Cleyn, MASurkyn, MFraiponts, EAerssens, JNijsen, MJGijsen, HJ 5-Sulfonyl-benzimidazoles as selective CB2 agonists. Bioorg Med Chem Lett 18:2574-9 (2008)  
Target
Name:
Cannabinoid receptor 2
Synonyms:
CANNABINOID CB2 CB2 CB2B CNR2_HUMAN Cannabinoid CB2 receptor Cannabinoid receptor 2 (CB2R) | hCB2
Type:
G Protein-Coupled Receptor (GPCR)
Mol. Mass.:
39690.94
Organism:
Homo sapiens (Human)
Description:
P34972
Residue:
360
  
Inhibitor
Name:
BDBM50364081
Synonyms:
CHEMBL411504
Type:
Small organic molecule
Emp. Form.:
C24H31N3O4S
Mol. Mass.:
457.586
SMILES:
CCOc1cc(ccn1)S(=O)(=O)c1ccc2n(CC3CCOCC3)c(nc2c1)C(C)(C)C
: