Target
Muscarinic acetylcholine receptor M4
Ligand
BDBM50071171
Substrate
Meas. Tech.
ChEMBL_477429 (CHEMBL929415)
EC50
54±n/a nM
Citation
 Varoli, LAndreani, ABurnelli, SGranaiola, MLeoni, ALocatelli, AMorigi, RRambaldi, MBedini, AFazio, NSpampinato, S Diphenidol-related diamines as novel muscarinic M4 receptor antagonists. Bioorg Med Chem Lett 18:2972-6 (2008)  
Target
Name:
Muscarinic acetylcholine receptor M4
Synonyms:
ACM4_HUMAN Cholinergic, muscarinic M4 Muscarinic acetylcholine receptor M2 and M4
Type:
Enzyme Catalytic Domain
Mol. Mass.:
53079.31
Organism:
Homo sapiens (Human)
Description:
Cholinergic, muscarinic M4 CHRM4 HUMAN M3::P08173
Residue:
479
  
Inhibitor
Name:
BDBM50071171
Synonyms:
9-Methoxy-2-methyl-11,12-dihydro-3H,6aH,13H-6-oxa-3,12a-diaza-benzo[a]cyclopenta[h]anthracene-1-carboxylic acid ethyl ester | CHEMBL59898
Type:
Small organic molecule
Emp. Form.:
C23H24N2O4
Mol. Mass.:
392.4477
SMILES:
CCOC(=O)c1c(C)[nH]c2ccc3OC4N(CCc5cc(OC)ccc45)Cc3c12
: