Target
Growth hormone secretagogue receptor type 1
Ligand
BDBM50376763
Substrate
Meas. Tech.
ChEMBL_477813 (CHEMBL931245)
EC50
140±n/a nM
Citation
 Li, JJWang, HLi, JQu, FSwartz, SGHernández, ASBiller, SARobl, JATino, JASlusarchyk, DSeethala, RSleph, PYan, MGrover, GFlynn, NMurphy, BJGordon, D Tetrazole based amides as growth hormone secretagogues. Bioorg Med Chem Lett 18:2536-9 (2008)  
Target
Name:
Growth hormone secretagogue receptor type 1
Synonyms:
GH-releasing peptide receptor GHS-R GHSR_HUMAN Ghrelin receptor | Ghrelin receptor 1a (GHS-R1a)
Type:
Receptor
Mol. Mass.:
41334.57
Organism:
Homo sapiens (Human)
Description:
Receptor binding studies use plasma membranes from LLC PK-1 cells transiently transfected with hGHSR1a.
Residue:
366
  
Inhibitor
Name:
BDBM50376763
Synonyms:
CHEMBL263141
Type:
Small organic molecule
Emp. Form.:
C23H35N7O5
Mol. Mass.:
489.5679
SMILES:
CCOC(=O)CCNC(=O)CCCn1nnnc1[C@@H](COCc1ccccc1)NC(=O)C(C)(C)N
: