Target
P2Y purinoceptor 6
Ligand
BDBM50118213
Substrate
Meas. Tech.
ChEMBL_552859 (CHEMBL958064)
EC50
>10000±n/a nM
Citation
 Ko, HCarter, RLCosyn, LPetrelli, Rde Castro, SBesada, PZhou, YCappellacci, LFranchetti, PGrifantini, MVan Calenbergh, SHarden, TKJacobson, KA Synthesis and potency of novel uracil nucleotides and derivatives as P2Y2 and P2Y6 receptor agonists. Bioorg Med Chem 16:6319-32 (2008)  
Target
Name:
P2Y purinoceptor 6
Synonyms:
P2RY6 P2Y purinoceptor 6 Pyrimidinergic receptor P2Y6
Type:
PROTEIN
Mol. Mass.:
36452.29
Organism:
Homo sapiens (Human)
Description:
ChEMBL_1511151
Residue:
328
  
Inhibitor
Name:
BDBM50118213
Synonyms:
5'-UTP H4utp uridine 5'-(tetrahydrogen triphosphate) | uridine 5'-triphosphoric acid
Type:
Small organic molecule
Emp. Form.:
C9H15N2O15P3
Mol. Mass.:
484.1411
SMILES:
O[C@@H]1[C@@H](COP(O)(=O)OP(O)(=O)OP(O)(O)=O)O[C@H]([C@@H]1O)n1ccc(=O)[nH]c1=O
: