Target
Acetylcholinesterase
Ligand
BDBM50271226
Substrate
Meas. Tech.
ChEMBL_552871 (CHEMBL960588)
IC50
1451±n/a nM
Citation
 Camps, PFormosa, XGaldeano, CGómez, TMuñoz-Torrero, DScarpellini, MViayna, EBadia, AClos, MVCamins, APallàs, MBartolini, MMancini, FAndrisano, VEstelrich, JLizondo, MBidon-Chanal, ALuque, FJ Novel donepezil-based inhibitors of acetyl- and butyrylcholinesterase and acetylcholinesterase-induced beta-amyloid aggregation. J Med Chem 51:3588-98 (2008)  
Target
Name:
Acetylcholinesterase
Synonyms:
ACES_BOVIN Acetylcholinesterase (AChE) | Acetylcholinesterase precursor
Type:
Enzyme
Mol. Mass.:
67659.62
Organism:
Bos taurus (bovine)
Description:
Residue:
613
  
Inhibitor
Name:
BDBM50271226
Synonyms:
2-[(1-benzylpiperidin-4-yl)methyl]-5,6-dimethoxyindane hydrochloride | CHEMBL486699
Type:
Small organic molecule
Emp. Form.:
C24H31NO2
Mol. Mass.:
365.5084
SMILES:
COc1cc2CC(CC3CCN(Cc4ccccc4)CC3)Cc2cc1OC
: