Target
Acetylcholinesterase
Ligand
BDBM50271142
Substrate
Meas. Tech.
ChEMBL_552872 (CHEMBL960589)
IC50
0.27±n/a nM
Citation
 Camps, PFormosa, XGaldeano, CGómez, TMuñoz-Torrero, DScarpellini, MViayna, EBadia, AClos, MVCamins, APallàs, MBartolini, MMancini, FAndrisano, VEstelrich, JLizondo, MBidon-Chanal, ALuque, FJ Novel donepezil-based inhibitors of acetyl- and butyrylcholinesterase and acetylcholinesterase-induced beta-amyloid aggregation. J Med Chem 51:3588-98 (2008)  
Target
Name:
Acetylcholinesterase
Synonyms:
ACES_HUMAN Acetylcholinesterase (AChE) | Acetylcholinesterase (human AChE)
Type:
Enzyme
Mol. Mass.:
67792.70
Organism:
Homo sapiens (Human)
Description:
P22303
Residue:
614
  
Inhibitor
Name:
BDBM50271142
Synonyms:
6-Chloro-9-[(3-{4-[(5,6-Dimethoxy-1-oxoindan-2-yl)methyl]piperidin-1-yl}propyl)amino]-1,2,3,4-tetrahydroacridine dihydrochloride | CHEMBL502725
Type:
Small organic molecule
Emp. Form.:
C33H40ClN3O3
Mol. Mass.:
562.142
SMILES:
COc1cc2CC(CC3CCN(CCCNc4c5CCCCc5nc5cc(Cl)ccc45)CC3)C(=O)c2cc1OC
: