Target
Acetylcholinesterase
Ligand
BDBM50041234
Substrate
Meas. Tech.
ChEMBL_508688 (CHEMBL1003053)
IC50
54000±n/a nM
Citation
 Kang, SYLee, KYSung, SHPark, MJKim, YC Coumarins isolated from Angelica gigas inhibit acetylcholinesterase: structure-activity relationships. J Nat Prod 64:683-5 (2001)  
Target
Name:
Acetylcholinesterase
Synonyms:
ACES_HUMAN Acetylcholinesterase (AChE) | Acetylcholinesterase (human AChE)
Type:
Enzyme
Mol. Mass.:
67792.70
Organism:
Homo sapiens (Human)
Description:
P22303
Residue:
614
  
Inhibitor
Name:
BDBM50041234
Synonyms:
6-hydroxy-7-methoxy-5-benzofuranacrylic acid delta-lactone 8-methoxy-2',3',6,7-furocoumarin 8-methoxy-[furano-3'.2':6.7-coumarin] 9-methoxy-7H-furo[3,2-g][1]benzopyran-7-one CHEMBL416 xanthotoxin
Type:
Small organic molecule
Emp. Form.:
C12H8O4
Mol. Mass.:
216.1895
SMILES:
COc1c2occc2cc2ccc(=O)oc12
: