Target
Aspartate-semialdehyde dehydrogenase
Ligand
BDBM50377941
Substrate
Meas. Tech.
ChEMBL_550047 (CHEMBL1003381)
IC50
306000±n/a nM
Citation
 Carroll, ARNgo, AQuinn, RJRedburn, JHooper, JN Petrosamine B, an inhibitor of the Helicobacter pylori enzyme aspartyl semialdehyde dehydrogenase from the Australian sponge Oceanapia sp. J Nat Prod 68:804-6 (2005)  
Target
Name:
Aspartate-semialdehyde dehydrogenase
Synonyms:
DHAS_HELPY | asd
Type:
PROTEIN
Mol. Mass.:
38120.98
Organism:
Helicobacter pylori
Description:
ChEMBL_550047
Residue:
346
  
Inhibitor
Name:
BDBM50377941
Synonyms:
PETROSAMINE B
Type:
Small organic molecule
Emp. Form.:
C21H18BrN3O2
Mol. Mass.:
424.289
SMILES:
Cn1ccc2c(c1)c(=[OH+])c1c3c(C(=O)C[N+]1(C)C)c1cc(Br)ccc1nc23
: