Target
Xanthine dehydrogenase/oxidase
Ligand
BDBM23416
Substrate
Meas. Tech.
ChEMBL_547369 (CHEMBL1023248)
IC50
>100000±n/a nM
Citation
 Cos, PYing, LCalomme, MHu, JPCimanga, KVan Poel, BPieters, LVlietinck, AJVanden Berghe, D Structure-activity relationship and classification of flavonoids as inhibitors of xanthine oxidase and superoxide scavengers. J Nat Prod 61:71-6 (1998)  
Target
Name:
Xanthine dehydrogenase/oxidase
Synonyms:
XD XDHA XO Xanthine dehydrogenase/oxidase | Xanthine oxidase
Type:
Enzyme
Mol. Mass.:
146441.21
Organism:
Homo sapiens (Human)
Description:
P47989
Residue:
1333
  
Inhibitor
Name:
BDBM23416
Synonyms:
α-CA inhibitor, 3 (2R,3S)-2-(3,4-dihydroxyphenyl)-3,4-dihydro-2H-1-benzopyran-3,5,7-triol Catechin | D-Catechin
Type:
Flavonol
Emp. Form.:
C15H14O6
Mol. Mass.:
290.2681
SMILES:
O[C@H]1Cc2c(O)cc(O)cc2O[C@@H]1c1ccc(O)c(O)c1
: