Target
Sex hormone-binding globulin
Ligand
BDBM50250487
Substrate
Meas. Tech.
ChEMBL_547404 (CHEMBL1025921)
IC50
620000±n/a nM
Citation
 Schöttner, MSpiteller, GGansser, D Lignans interfering with 5 alpha-dihydrotestosterone binding to human sex hormone-binding globulin. J Nat Prod 61:119-21 (1998)  
Target
Name:
Sex hormone-binding globulin
Synonyms:
SHBG Testis-specific androgen-binding protein
Type:
PROTEIN
Mol. Mass.:
43780.19
Organism:
Homo sapiens (Human)
Description:
ChEMBL_466706
Residue:
402
  
Inhibitor
Name:
BDBM50250487
Synonyms:
(+/-)-enterolactone | CHEMBL465152
Type:
Small organic molecule
Emp. Form.:
C18H18O4
Mol. Mass.:
298.3331
SMILES:
Oc1cccc(CC2COC(=O)C2Cc2cccc(O)c2)c1
: