Target
Fatty-acid amide hydrolase 1 [30-579]
Ligand
BDBM50262032
Substrate
Meas. Tech.
ChEMBL_513860 (CHEMBL970754)
Ki
0.3±n/a nM
Citation
 Garfunkle, JEzzili, CRayl, TJHochstatter, DGHwang, IBoger, DL Optimization of the central heterocycle of alpha-ketoheterocycle inhibitors of fatty acid amide hydrolase. J Med Chem 51:4392-403 (2008)  
Target
Name:
Fatty-acid amide hydrolase 1 [30-579]
Synonyms:
Anandamide amidohydrolase 1 Faah Fatty Acid Amide Hydrolase Fatty-acid amide hydrolase (FAAH) Fatty-acid amide hydrolase 1 (FAAH) Oleamide hydrolase 1
Type:
Single-pass membrane protein; homodimer
Mol. Mass.:
60474.00
Organism:
Rattus norvegicus (rat)
Description:
P97612 (aa 30-579)
Residue:
550
  
Inhibitor
Name:
BDBM50262032
Synonyms:
3-(Biphenyl-4-yl)-1-(5-(pyridin-2-yl)-1,3,4-oxadiazol-2-yl)-propan-1-one | CHEMBL468226
Type:
Small organic molecule
Emp. Form.:
C22H17N3O2
Mol. Mass.:
355.3893
SMILES:
O=C(CCc1ccc(cc1)-c1ccccc1)c1nnc(o1)-c1ccccn1
: