Target
Kappa-type opioid receptor
Ligand
BDBM50262556
Substrate
Meas. Tech.
ChEMBL_513622 (CHEMBL970713)
Ki
4650±n/a nM
Citation
 Sakami, SMaeda, MKawai, KAoki, TKawamura, KFujii, HHasebe, KNakajima, MEndo, TUeno, SIto, TKamei, JNagase, H Structure-antitussive activity relationships of naltrindole derivatives. Identification of novel and potent antitussive agents. J Med Chem 51:4404-11 (2008)  
Target
Name:
Kappa-type opioid receptor
Synonyms:
Kappa Opioid Receptor OPRK1 Opiate Kappa 1 | mu/kappa opioid receptor
Type:
G Protein-Coupled Receptor (GPCR)
Mol. Mass.:
42744.99
Organism:
Cavia porcellus (domestic guinea pig)
Description:
P41144
Residue:
380
  
Inhibitor
Name:
BDBM50262556
Synonyms:
(5R,9R,13S,14S)-17-Cyclopropylmethyl-6,7-didehydro-4,5-epoxy-1'-ethyl-3-methoxy-7'-methyl-indolo[2',3':6,7]morphinan-14-ol | CHEMBL514366
Type:
Small organic molecule
Emp. Form.:
C30H34N2O3
Mol. Mass.:
470.6026
SMILES:
CCn1c2[C@@H]3Oc4c5c(C[C@H]6N(CC7CC7)CC[C@@]35[C@@]6(O)Cc2c2cccc(C)c12)ccc4OC
: