Target
Carbonic anhydrase 5A, mitochondrial
Ligand
BDBM50262015
Substrate
Meas. Tech.
ChEMBL_514688 (CHEMBL976460)
Ki
9.3±n/a nM
Citation
 Poulsen, SAWilkinson, BLInnocenti, AVullo, DSupuran, CT Inhibition of human mitochondrial carbonic anhydrases VA and VB with para-(4-phenyltriazole-1-yl)-benzenesulfonamide derivatives. Bioorg Med Chem Lett 18:4624-7 (2008)  
Target
Name:
Carbonic anhydrase 5A, mitochondrial
Synonyms:
CA-VA CA5A Carbonate dehydratase VA Carbonic anhydrase 5A (CA VA) Carbonic anhydrase 5A, mitochondrial precursor Carbonic anhydrase VA (CA VA)
Type:
Enzyme
Mol. Mass.:
34755.54
Organism:
Homo sapiens (Human)
Description:
Human (cloned) isozyme
Residue:
305
  
Inhibitor
Name:
BDBM50262015
Synonyms:
4-(4-o-tolyl-1H-1,2,3-triazol-1-yl)benzenesulfonamide | CHEMBL445517
Type:
Small organic molecule
Emp. Form.:
C15H14N4O2S
Mol. Mass.:
314.362
SMILES:
Cc1ccccc1-c1cn(nn1)-c1ccc(cc1)S(N)(=O)=O
: