Target
Sodium-dependent serotonin transporter
Ligand
BDBM35226
Substrate
Meas. Tech.
ChEMBL_491869 (CHEMBL946206)
IC50
5200±n/a nM
Citation
 Zhang, MJovic, FVickers, TDyck, BTamiya, JGrey, JTran, JAFleck, BAPick, RFoster, ACChen, C Studies on the structure-activity relationship of bicifadine analogs as monoamine transporter inhibitors. Bioorg Med Chem Lett 18:3682-6 (2008)  
Target
Name:
Sodium-dependent serotonin transporter
Synonyms:
5-HT Transporter 5HT transporter Anandamid membrane transporter, AMT Monoamine transporters; Norepinephrine & serotonin Slc6a4 Sodium-dependent serotonin transporter (SERT) | imipramine receptor
Type:
Multi-pass membrane protein
Mol. Mass.:
70168.43
Organism:
Rattus norvegicus (rat)
Description:
P31652
Residue:
630
  
Inhibitor
Name:
BDBM35226
Synonyms:
(S,S)-reboxetine Vestra
Type:
Small organic molecule
Emp. Form.:
C19H23NO3
Mol. Mass.:
313.3908
SMILES:
CCOc1ccccc1O[C@H]([C@@H]1CNCCO1)c1ccccc1
: