Target
5-hydroxytryptamine receptor 2A
Ligand
BDBM28582
Substrate
Meas. Tech.
ChEMBL_537763 (CHEMBL994216)
Ki
0.92±n/a nM
Citation
 Runyon, SPMosier, PDRoth, BLGlennon, RAWestkaemper, RB Potential modes of interaction of 9-aminomethyl-9,10-dihydroanthracene (AMDA) derivatives with the 5-HT2A receptor: a ligand structure-affinity relationship, receptor mutagenesis and receptor modeling investigation. J Med Chem 51:6808-28 (2008)  
Target
Name:
5-hydroxytryptamine receptor 2A
Synonyms:
5-HT-2 5-HT2A 5-hydroxytryptamine receptor 2A (5HT-2A) 5HT2A_HUMAN HTR2A | Serotonin receptor 2A
Type:
undefined
Mol. Mass.:
52607.65
Organism:
Homo sapiens (Human)
Description:
P28223
Residue:
471
  
Inhibitor
Name:
BDBM28582
Synonyms:
1-(4-iodo-2,5-dimethoxyphenyl)propan-2-amine DOI DOI,(-) [125I]4-iodo-2,5-dimethoxyphenylisopropylamine | [125I]DOI
Type:
radiolabeled ligand
Emp. Form.:
C11H16INO2
Mol. Mass.:
321.1547
SMILES:
COc1cc(CC(C)N)c(OC)cc1I
: