Target
4-hydroxy-tetrahydrodipicolinate synthase
Ligand
BDBM50412477
Substrate
Meas. Tech.
ChEMBL_536816 (CHEMBL988080)
Ki
1630000±n/a nM
Citation
 Boughton, BAGriffin, MDO'Donnell, PADobson, RCPerugini, MAGerrard, JAHutton, CA Irreversible inhibition of dihydrodipicolinate synthase by 4-oxo-heptenedioic acid analogues. Bioorg Med Chem 16:9975-83 (2008)  
Target
Name:
4-hydroxy-tetrahydrodipicolinate synthase
Synonyms:
DAPA_ECOLI dapA
Type:
PROTEIN
Mol. Mass.:
31269.12
Organism:
Escherichia coli (strain K12)
Description:
ChEMBL_536816
Residue:
292
  
Inhibitor
Name:
BDBM50412477
Synonyms:
CHEMBL456159
Type:
Small organic molecule
Emp. Form.:
C7H6O5
Mol. Mass.:
170.1195
SMILES:
OC(=O)\C=C\C(=O)\C=C\C(O)=O
: