Target
Solute carrier family 22 member 1
Ligand
BDBM50062599
Substrate
Meas. Tech.
ChEMBL_534654 (CHEMBL994103)
IC50
27200±n/a nM
Citation
 Ahlin, GKarlsson, JPedersen, JMGustavsson, LLarsson, RMatsson, PNorinder, UBergström, CAArtursson, P Structural requirements for drug inhibition of the liver specific human organic cation transport protein 1. J Med Chem 51:5932-42 (2008)  
Target
Name:
Solute carrier family 22 member 1
Synonyms:
Adrenergic Alpha Organic cation transporter 1 SLC22A1 hOCT1
Type:
Enzyme Catalytic Domain
Mol. Mass.:
61154.85
Organism:
Homo sapiens (Human)
Description:
Adrenergic Alpha 0 HUMAN::O15245
Residue:
554
  
Inhibitor
Name:
BDBM50062599
Synonyms:
3,5-Dimethyl-adamantan-1-ylamine EN300-123026 Namenda | US10214478, Compound memantine
Type:
Small organic molecule
Emp. Form.:
C12H21N
Mol. Mass.:
179.3018
SMILES:
CC12CC3CC(C)(C1)CC(N)(C3)C2
: