Target
Melanocortin receptor 4
Ligand
BDBM50115366
Substrate
Meas. Tech.
ChEMBL_539391 (CHEMBL1027275)
EC50
390±n/a nM
Citation
 Proneth, BPogozheva, IDPortillo, FPMosberg, HIHaskell-Luevano, C Melanocortin tetrapeptide Ac-His-DPhe-Arg-Trp-NH2 modified at the para position of the benzyl side chain (DPhe): importance for mouse melanocortin-3 receptor agonist versus antagonist activity. J Med Chem 51:5585-93 (2008)  
Target
Name:
Melanocortin receptor 4
Synonyms:
MC4-R Mc4r
Type:
PROTEIN
Mol. Mass.:
36964.43
Organism:
Mus musculus
Description:
ChEMBL_1498850
Residue:
332
  
Inhibitor
Name:
BDBM50115366
Synonyms:
2-[2-[2-Acetylamino-3-(3H-imidazol-4-yl)-propionylamino]-3-(4-hydroxy-phenyl)-propionylamino]-5-guanidino-pentanoic acid [1-carbamoyl-2-(1H-indol-3-yl)-ethyl]-amide CHEMBL105113
Type:
Small organic molecule
Emp. Form.:
C34H43N11O6
Mol. Mass.:
701.7753
SMILES:
CC(=O)N[C@@H](Cc1cnc[nH]1)C(=O)N[C@H](Cc1ccc(O)cc1)C(=O)N[C@@H](CCCN=C(N)N)C(=O)N[C@@H](Cc1c[nH]c2ccccc12)C(N)=O
: