Target
Melanocortin receptor 4
Ligand
BDBM50252902
Substrate
Meas. Tech.
ChEMBL_539392 (CHEMBL1027276)
Ki
19±n/a nM
Citation
 Proneth, BPogozheva, IDPortillo, FPMosberg, HIHaskell-Luevano, C Melanocortin tetrapeptide Ac-His-DPhe-Arg-Trp-NH2 modified at the para position of the benzyl side chain (DPhe): importance for mouse melanocortin-3 receptor agonist versus antagonist activity. J Med Chem 51:5585-93 (2008)  
Target
Name:
Melanocortin receptor 4
Synonyms:
MC4-R Mc4r
Type:
PROTEIN
Mol. Mass.:
36964.43
Organism:
Mus musculus
Description:
ChEMBL_1498850
Residue:
332
  
Inhibitor
Name:
BDBM50252902
Synonyms:
Ac-His-DNal(2)-Arg-Trp-NH2 | CHEMBL454736
Type:
Small organic molecule
Emp. Form.:
C38H45N11O5
Mol. Mass.:
735.8346
SMILES:
CC(=O)N[C@H](Cc1cnc[nH]1)C(=O)N[C@@H](Cc1ccc2ccccc2c1)C(=O)N[C@@H](CCCN=C(N)N)C(=O)N[C@@H](Cc1c[nH]c2ccccc12)C(N)=O
: