Target
Glutamate receptor ionotropic, kainate 2
Ligand
BDBM17657
Substrate
Meas. Tech.
ChEMBL_539476 (CHEMBL1028972)
Ki
332±n/a nM
Citation
 Butini, SPickering, DSMorelli, ECoccone, SSTrotta, FDe Angelis, MGuarino, EFiorini, ICampiani, GNovellino, ESchousboe, AChristensen, JKGemma, S 1H-cyclopentapyrimidine-2,4(1H,3H)-dione-related ionotropic glutamate receptors ligands. structure-activity relationships and identification of potent and Selective iGluR5 modulators. J Med Chem 51:6614-8 (2008)  
Target
Name:
Glutamate receptor ionotropic, kainate 2
Synonyms:
GRIK2_RAT Glutamate receptor ionotropic kainate 2 Ionotropic glutamate receptor kainate 2/5
Type:
PROTEIN
Mol. Mass.:
102478.61
Organism:
Rattus norvegicus
Description:
ChEMBL_936439
Residue:
908
  
Inhibitor
Name:
BDBM17657
Synonyms:
(2S)-2-aminopentanedioic acid D-Glutamate L-Glu L-Glutamic acid L-gluatmate
Type:
Amino Acid
Emp. Form.:
C5H9NO4
Mol. Mass.:
147.1293
SMILES:
N[C@@H](CCC(O)=O)C(O)=O
: