Target
Mu-type opioid receptor
Ligand
BDBM50255955
Substrate
Meas. Tech.
ChEMBL_515867 (CHEMBL993921)
Ki
102±n/a nM
Citation
 Hayashi, SHirao, AImai, ANakamura, HMurata, YOhashi, KNakata, E Novel non-peptide nociceptin/orphanin FQ receptor agonist, 1-[1-(1-Methylcyclooctyl)-4-piperidinyl]-2-[(3R)-3-piperidinyl]-1H-benzimidazole: design, synthesis, and structure-activity relationship of oral receptor occupancy in the brain for orally potent antianxiety drug. J Med Chem 52:610-25 (2009)  
Target
Name:
Mu-type opioid receptor
Synonyms:
M-OR-1 MOR-1 MUOR1 Mu opiate receptor OPRM1 hMOP | mu-type opioid receptor isoform MOR-1
Type:
G Protein-Coupled Receptor (GPCR)
Mol. Mass.:
44789.51
Organism:
Homo sapiens (Human)
Description:
P35372
Residue:
400
  
Inhibitor
Name:
BDBM50255955
Synonyms:
2-(1-Benzofuran-2-yl)-1-[1-(1-methylcyclooctyl)piperidin-4-yl]-1H-benzimidazole | CHEMBL481707
Type:
Small organic molecule
Emp. Form.:
C29H35N3O
Mol. Mass.:
441.6077
SMILES:
CC1(CCCCCCC1)N1CCC(CC1)n1c(nc2ccccc12)-c1cc2ccccc2o1
: