Target
Trans-sialidase
Ligand
BDBM4706
Substrate
Meas. Tech.
ChEMBL_516600 (CHEMBL988687)
Ki
12300000±n/a nM
Citation
 Neres, JBrewer, MLRatier, LBotti, HBuschiazzo, AEdwards, PNMortenson, PNCharlton, MHAlzari, PMFrasch, ACBryce, RADouglas, KT Discovery of novel inhibitors of Trypanosoma cruzi trans-sialidase from in silico screening. Bioorg Med Chem Lett 19:589-96 (2009)  
Target
Name:
Trans-sialidase
Synonyms:
Type:
Mol. Mass.:
70598.62
Organism:
Trypanosoma cruzi
Description:
Q26966
Residue:
642
  
Inhibitor
Name:
BDBM4706
Synonyms:
(2R,3R,4S)-3-acetamido-4-hydroxy-2-[(1R,2R)-1,2,3-trihydroxypropyl]-3,4-dihydro-2H-pyran-6-carboxylic acid CHEMBL96712 Neu5Ac2en
Type:
Small organic molecule
Emp. Form.:
C11H17NO8
Mol. Mass.:
291.2546
SMILES:
CC(=O)N[C@@H]1[C@@H](O)C=C(O[C@H]1[C@H](O)[C@H](O)CO)C(O)=O
: