Target
Adenosine receptor A1
Ligand
BDBM50256895
Substrate
Meas. Tech.
ChEMBL_566529 (CHEMBL955115)
Ki
830±n/a nM
Citation
 Lambertucci, CAntonini, IBuccioni, MDal Ben, DKachare, DDVolpini, RKlotz, KNCristalli, G 8-Bromo-9-alkyl adenine derivatives as tools for developing new adenosine A2A and A2B receptors ligands. Bioorg Med Chem 17:2812-22 (2009)  
Target
Name:
Adenosine receptor A1
Synonyms:
A1 adenosine receptor (hA1) AA1R_HUMAN ADORA1 Adenosine A1-receptor Adenosine receptor A1 (hA1) | Adenosine transporter (AdT)
Type:
G Protein-Coupled Receptor (GPCR)
Mol. Mass.:
36520.92
Organism:
Homo sapiens (Human)
Description:
P30542
Residue:
326
  
Inhibitor
Name:
BDBM50256895
Synonyms:
8-Bromo-9-isopropyl-9H-adenine | CHEMBL446264
Type:
Small organic molecule
Emp. Form.:
C8H10BrN5
Mol. Mass.:
256.102
SMILES:
CC(C)n1c(Br)nc2c(N)ncnc12
: