Target
Cytochrome P450 3A4
Ligand
BDBM50041457
Substrate
Meas. Tech.
ChEMBL_567194 (CHEMBL1029106)
IC50
>100000±n/a nM
Citation
 O'Neill, PMShone, AEStanford, DNixon, GAsadollahy, EPark, BKMaggs, JLRoberts, PStocks, PABiagini, GBray, PGDavies, JBerry, NHall, CRimmer, KWinstanley, PAHindley, SBambal, RBDavis, CBBates, MGresham, SLBrigandi, RAGomez-de-Las-Heras, FMGargallo, DVParapini, SVivas, LLander, HTaramelli, DWard, SA Synthesis, antimalarial activity, and preclinical pharmacology of a novel series of 4'-fluoro and 4'-chloro analogues of amodiaquine. Identification of a suitable"back-up" compound for N-tert-butyl isoquine. J Med Chem 52:1828-44 (2009)  
Target
Name:
Cytochrome P450 3A4
Synonyms:
Albendazole monooxygenase CP3A4_HUMAN CYP3A4 CYPIIIA4 Cytochrome P450 3A4 (CYP3A4) Nifedipine oxidase Taurochenodeoxycholate 6-alpha-hydroxylase
Type:
Enzyme
Mol. Mass.:
57349.57
Organism:
Homo sapiens (Human)
Description:
Residue:
503
  
Inhibitor
Name:
BDBM50041457
Synonyms:
4-[(7-chloroquinolin-4-yl)amino]-2-[(diethylamino)methyl]phenol CHEMBL682 | med.21724, Compound 188
Type:
Small organic molecule
Emp. Form.:
C20H22ClN3O
Mol. Mass.:
355.861
SMILES:
CCN(CC)Cc1cc(Nc2ccnc3cc(Cl)ccc23)ccc1O
: