Target
Cytochrome P450 2C8
Ligand
BDBM50041457
Substrate
Meas. Tech.
ChEMBL_567198 (CHEMBL1029110)
IC50
2700±n/a nM
Citation
 O'Neill, PMShone, AEStanford, DNixon, GAsadollahy, EPark, BKMaggs, JLRoberts, PStocks, PABiagini, GBray, PGDavies, JBerry, NHall, CRimmer, KWinstanley, PAHindley, SBambal, RBDavis, CBBates, MGresham, SLBrigandi, RAGomez-de-Las-Heras, FMGargallo, DVParapini, SVivas, LLander, HTaramelli, DWard, SA Synthesis, antimalarial activity, and preclinical pharmacology of a novel series of 4'-fluoro and 4'-chloro analogues of amodiaquine. Identification of a suitable"back-up" compound for N-tert-butyl isoquine. J Med Chem 52:1828-44 (2009)  
Target
Name:
Cytochrome P450 2C8
Synonyms:
CP2C8_HUMAN CYPIIC8 P450 IIC2 P450 form 1 | S-mephenytoin 4-hydroxylase
Type:
Protein
Mol. Mass.:
55839.23
Organism:
Homo sapiens (Human)
Description:
P10632
Residue:
490
  
Inhibitor
Name:
BDBM50041457
Synonyms:
4-[(7-chloroquinolin-4-yl)amino]-2-[(diethylamino)methyl]phenol CHEMBL682 | med.21724, Compound 188
Type:
Small organic molecule
Emp. Form.:
C20H22ClN3O
Mol. Mass.:
355.861
SMILES:
CCN(CC)Cc1cc(Nc2ccnc3cc(Cl)ccc23)ccc1O
: