Target
Carbonic anhydrase 2
Ligand
BDBM50278780
Substrate
Meas. Tech.
ChEMBL_501258 (CHEMBL976160)
Ki
6.9±n/a nM
Citation
 Singer, MLopez, MBornaghi, LFInnocenti, AVullo, DSupuran, CTPoulsen, SA Inhibition of carbonic anhydrase isozymes with benzene sulfonamides incorporating thio, sulfinyl and sulfonyl glycoside moieties. Bioorg Med Chem Lett 19:2273-6 (2009)  
Target
Name:
Carbonic anhydrase 2
Synonyms:
CA-II CAC Carbonate dehydratase II Carbonic anhydrase 2 (CA-II) Carbonic anhydrase C Carbonic anhydrase II (CA-II) Carbonic anhydrase II (hCA II) | Carbonic anhydrase isoenzyme II (hCA II)
Type:
Enzyme
Mol. Mass.:
29250.71
Organism:
Homo sapiens (Human)
Description:
P00918
Residue:
260
  
Inhibitor
Name:
BDBM50278780
Synonyms:
(2R,3R,4S,5R,6S)-2-(acetoxymethyl)-6-((1-(4-sulfamoylphenyl)-1H-1,2,3-triazol-4-yl)methylsulfonyl)tetrahydro-2H-pyran-3,4,5-triyl triacetate CHEMBL444912
Type:
Small organic molecule
Emp. Form.:
C23H28N4O13S2
Mol. Mass.:
632.617
SMILES:
CC(=O)OC[C@H]1O[C@H]([C@H](OC(C)=O)[C@@H](OC(C)=O)[C@@H]1OC(C)=O)S(=O)(=O)Cc1cn(nn1)-c1ccc(cc1)S(N)(=O)=O
: