Target
Carbonic anhydrase 12
Ligand
BDBM50278779
Substrate
Meas. Tech.
ChEMBL_501260 (CHEMBL976162)
Ki
8.4±n/a nM
Citation
 Singer, MLopez, MBornaghi, LFInnocenti, AVullo, DSupuran, CTPoulsen, SA Inhibition of carbonic anhydrase isozymes with benzene sulfonamides incorporating thio, sulfinyl and sulfonyl glycoside moieties. Bioorg Med Chem Lett 19:2273-6 (2009)  
Target
Name:
Carbonic anhydrase 12
Synonyms:
CA-XII CAH12_HUMAN Carbonic anhydrase Carbonic anhydrase XII Carbonic anhydrase XII (CAXII) | Tumor antigen HOM-RCC-3.1.3
Type:
Enzyme
Mol. Mass.:
39456.00
Organism:
Homo sapiens (Human)
Description:
Catalytic domain of human cloned isozyme was used in the assay
Residue:
354
  
Inhibitor
Name:
BDBM50278779
Synonyms:
4-(4-{[2',3',4',6'-Tetra-O-acetyl-beta-D-glucopyranosyl]sulfinylmethyl}-1-H-1,2,3-triazol-1-yl)benzenesulfonamide | CHEMBL480302
Type:
Small organic molecule
Emp. Form.:
C23H28N4O12S2
Mol. Mass.:
616.618
SMILES:
CC(=O)OC[C@H]1O[C@H]([C@H](OC(C)=O)[C@@H](OC(C)=O)[C@@H]1OC(C)=O)S(=O)Cc1cn(nn1)-c1ccc(cc1)S(N)(=O)=O
: