Target
Carbonic anhydrase 12
Ligand
BDBM50278846
Substrate
Meas. Tech.
ChEMBL_501260 (CHEMBL976162)
Ki
10±n/a nM
Citation
 Singer, MLopez, MBornaghi, LFInnocenti, AVullo, DSupuran, CTPoulsen, SA Inhibition of carbonic anhydrase isozymes with benzene sulfonamides incorporating thio, sulfinyl and sulfonyl glycoside moieties. Bioorg Med Chem Lett 19:2273-6 (2009)  
Target
Name:
Carbonic anhydrase 12
Synonyms:
CA-XII CAH12_HUMAN Carbonic anhydrase Carbonic anhydrase XII Carbonic anhydrase XII (CAXII) | Tumor antigen HOM-RCC-3.1.3
Type:
Enzyme
Mol. Mass.:
39456.00
Organism:
Homo sapiens (Human)
Description:
Catalytic domain of human cloned isozyme was used in the assay
Residue:
354
  
Inhibitor
Name:
BDBM50278846
Synonyms:
4-(4-(((2S,3R,4S,5S,6R)-3,4,5-trihydroxy-6-(hydroxymethyl)tetrahydro-2H-pyran-2-ylsulfonyl)methyl)-1H-1,2,3-triazol-1-yl)benzenesulfonamide CHEMBL498757
Type:
Small organic molecule
Emp. Form.:
C15H20N4O9S2
Mol. Mass.:
464.471
SMILES:
NS(=O)(=O)c1ccc(cc1)-n1cc(CS(=O)(=O)[C@@H]2O[C@H](CO)[C@@H](O)[C@H](O)[C@H]2O)nn1
: