Target
Cytosolic phospholipase A2
Ligand
BDBM50277799
Substrate
Meas. Tech.
ChEMBL_501719 (CHEMBL982355)
IC50
16±n/a nM
Citation
 Bovens, SKaptur, MElfringhoff, ASLehr, M 1-(5-Carboxyindol-1-yl)propan-2-ones as inhibitors of human cytosolic phospholipase A2alpha: synthesis and properties of bioisosteric benzimidazole, benzotriazole and indazole analogues. Bioorg Med Chem Lett 19:2107-11 (2009)  
Target
Name:
Cytosolic phospholipase A2
Synonyms:
CPLA2 PA24A_HUMAN PLA2G4A Phospholipase A2 | Phospholipase A2 group IVA
Type:
Protein
Mol. Mass.:
85219.30
Organism:
Homo sapiens (Human)
Description:
P47712
Residue:
749
  
Inhibitor
Name:
BDBM50277799
Synonyms:
1-(3-(4-octylphenoxy)-2-oxopropyl)-1H-benzo[d][1,2,3]triazole-6-carboxylic acid | CHEMBL484954
Type:
Small organic molecule
Emp. Form.:
C24H29N3O4
Mol. Mass.:
423.5048
SMILES:
CCCCCCCCc1ccc(OCC(=O)Cn2nnc3ccc(cc23)C(O)=O)cc1
: