Target
Melanocyte-stimulating hormone receptor
Ligand
BDBM50268799
Substrate
Meas. Tech.
ChEMBL_523576 (CHEMBL997226)
EC50
<0.1±n/a nM
Comments
Zero 20220115
Citation
 Qu, HCai, MMayorov, AVGrieco, PZingsheim, MTrivedi, DHruby, VJ Substitution of arginine with proline and proline derivatives in melanocyte-stimulating hormones leads to selectivity for human melanocortin 4 receptor. J Med Chem 52:3627-35 (2009)  
Target
Name:
Melanocyte-stimulating hormone receptor
Synonyms:
MC1-R MSH-R MSHR_HUMAN Melanocortin receptor (M1 and M4) Melanocortin receptor 1 (MC1-R) | Melanocortin receptor 1 (MC1R)
Type:
Enzyme
Mol. Mass.:
34717.23
Organism:
Homo sapiens (Human)
Description:
Q01726
Residue:
317
  
Inhibitor
Name:
BDBM50268799
Synonyms:
Ac-Nle-c[Asp-His-DNal(2')-trans-4-guanidinyl-Pro-Trp-Lys]-NH2 | CHEMBL509582
Type:
Small organic molecule
Emp. Form.:
C54H69N15O9
Mol. Mass.:
1072.2208
SMILES:
CCCC[C@H](NC(C)=O)C(=O)N[C@H]1CC(=O)NCCCC[C@H](NC(=O)[C@H](Cc2c[nH]c3ccccc23)NC(=O)[C@@H]2C[C@@H](CN2C(=O)[C@@H](Cc2ccc3ccccc3c2)NC(=O)[C@H](Cc2cnc[nH]2)NC1=O)N=C(N)N)C(N)=O
: