Target
Delta-type opioid receptor
Ligand
BDBM50294427
Substrate
Meas. Tech.
ChEMBL_575383 (CHEMBL1027057)
EC50
0.060000±n/a nM
Citation
 Nagase, HOsa, YNemoto, TFujii, HImai, MNakamura, TKanemasa, TKato, AGouda, HHirono, S Design and synthesis of novel delta opioid receptor agonists and their pharmacologies. Bioorg Med Chem Lett 19:2792-5 (2009)  
Target
Name:
Delta-type opioid receptor
Synonyms:
D-OR-1 Delta opioid receptor OPIATE Delta OPRD1 OPRK1 | opioid receptor, delta 1
Type:
G Protein-Coupled Receptor (GPCR)
Mol. Mass.:
40382.98
Organism:
Homo sapiens (Human)
Description:
Competition binding assays were carried out using membrane preparations from transfected HN9.10 cells that constitutively expressed the delta opioid receptor.
Residue:
372
  
Inhibitor
Name:
BDBM50294427
Synonyms:
CHEMBL564538 | SN-23
Type:
Small organic molecule
Emp. Form.:
C27H30N2O
Mol. Mass.:
398.5399
SMILES:
CC(C)CN1CC[C@]23Cc4nc5ccccc5cc4C[C@H]2[C@H]1Cc1ccc(O)cc31
: