Target
Beta-2 adrenergic receptor
Ligand
BDBM25769
Substrate
Meas. Tech.
ChEMBL_577488 (CHEMBL1057071)
Kd
1160±n/a nM
Citation
 Soriano-Ursúa, MAValencia-Hernández, IArellano-Mendoza, MGCorrea-Basurto, JTrujillo-Ferrara, JG Synthesis, pharmacological and in silico evaluation of 1-(4-di-hydroxy-3,5-dioxa-4-borabicyclo[4.4.0]deca-7,9,11-trien-9-yl)-2-(tert-butylamino)ethanol, a compound designed to act as a beta2 adrenoceptor agonist. Eur J Med Chem 44:2840-6 (2009)  
Target
Name:
Beta-2 adrenergic receptor
Synonyms:
ADRB2_CAVPO adrenergic Beta2
Type:
Enzyme Catalytic Domain
Mol. Mass.:
46993.24
Organism:
GUINEA PIG
Description:
adrenergic Beta2 ADRB2 GUINEA PIG::Q8K4Z4
Residue:
418
  
Inhibitor
Name:
BDBM25769
Synonyms:
4-[2-(tert-butylamino)-1-hydroxyethyl]-2-(hydroxymethyl)phenol Proventil Salbutamol,(+/-) | albuterol
Type:
Small organic molecule
Emp. Form.:
C13H21NO3
Mol. Mass.:
239.3107
SMILES:
CC(C)(C)NCC(O)c1ccc(O)c(CO)c1
: