Target
Proto-oncogene tyrosine-protein kinase LCK
Ligand
BDBM50248765
Substrate
Meas. Tech.
ChEMBL_587115 (CHEMBL1051325)
IC50
750±n/a nM
Citation
 Bain, JPlater, LElliott, MShpiro, NHastie, CJMcLauchlan, HKlevernic, IArthur, JSAlessi, DRCohen, P The selectivity of protein kinase inhibitors: a further update. Biochem J 408:297-315 (2007)  
Target
Name:
Proto-oncogene tyrosine-protein kinase LCK
Synonyms:
LCK_MOUSE Lck Lymphocyte cell-specific protein-tyrosine kinase Tyrosine-protein kinase LCK | p56-LCK
Type:
PROTEIN
Mol. Mass.:
57927.84
Organism:
Mus musculus
Description:
ChEMBL_806408
Residue:
509
  
Inhibitor
Name:
BDBM50248765
Synonyms:
1-(4-amino-7-(3-hydroxypropyl)-5-p-tolyl-7H-pyrrolo[2,3-d]pyrimidin-6-yl)-2-fluoroethanone | CHEMBL515414
Type:
Small organic molecule
Emp. Form.:
C18H19FN4O2
Mol. Mass.:
342.3675
SMILES:
Cc1ccc(cc1)-c1c(C(=O)CF)n(CCCO)c2ncnc(N)c12
: