Target
Proto-oncogene tyrosine-protein kinase LCK
Ligand
BDBM25116
Substrate
Meas. Tech.
ChEMBL_587115 (CHEMBL1051325)
IC50
40±n/a nM
Citation
 Bain, JPlater, LElliott, MShpiro, NHastie, CJMcLauchlan, HKlevernic, IArthur, JSAlessi, DRCohen, P The selectivity of protein kinase inhibitors: a further update. Biochem J 408:297-315 (2007)  
Target
Name:
Proto-oncogene tyrosine-protein kinase LCK
Synonyms:
LCK_MOUSE Lck Lymphocyte cell-specific protein-tyrosine kinase Tyrosine-protein kinase LCK | p56-LCK
Type:
PROTEIN
Mol. Mass.:
57927.84
Organism:
Mus musculus
Description:
ChEMBL_806408
Residue:
509
  
Inhibitor
Name:
BDBM25116
Synonyms:
1-tert-butyl-3-(4-methylphenyl)-1H-pyrazolo[3,4-d]pyrimidin-4-amine PP1 US10807986, Comparative compound 1 US11701353, PP1 (Pfizer) | cid_1400
Type:
Small organic molecule
Emp. Form.:
C16H19N5
Mol. Mass.:
281.3556
SMILES:
Cc1ccc(cc1)-c1nn(c2ncnc(N)c12)C(C)(C)C
: