Target
Carbonic anhydrase
Ligand
BDBM13063
Substrate
Meas. Tech.
ChEMBL_587743 (CHEMBL1038579)
Ki
28.7±n/a nM
Citation
 Bertucci, AInnocenti, AZoccola, DScozzafava, ATambutté, SSupuran, CT Carbonic anhydrase inhibitors. Inhibition studies of a coral secretory isoform by sulfonamides. Bioorg Med Chem 17:5054-8 (2009)  
Target
Name:
Carbonic anhydrase
Synonyms:
Alpha carbonic anhydrase
Type:
PROTEIN
Mol. Mass.:
36650.57
Organism:
Stylophora pistillata
Description:
ChEMBL_700658
Residue:
323
  
Inhibitor
Name:
BDBM13063
Synonyms:
4-(5-methyl-3-phenyl-1,2-oxazol-4-yl)benzene-1-sulfonamide CHEMBL865 Valdecoxib | cid_119607
Type:
Small organic molecule
Emp. Form.:
C16H14N2O3S
Mol. Mass.:
314.359
SMILES:
Cc1onc(c1-c1ccc(cc1)S(N)(=O)=O)-c1ccccc1
: