Target
Vasopressin V1b receptor
Ligand
BDBM50299347
Substrate
Meas. Tech.
ChEMBL_590268 (CHEMBL1052803)
Ki
>10000±n/a nM
Citation
 Scott, JDMiller, MWLi, SWLin, SIVaccaro, HAHong, LMullins, DEGuzzi, MWeinstein, JHodgson, RAVarty, GBStamford, AWChan, TYMcKittrick, BAGreenlee, WJPriestley, TParker, EM Tetrahydroquinoline sulfonamides as vasopressin 1b receptor antagonists. Bioorg Med Chem Lett 19:6018-22 (2009)  
Target
Name:
Vasopressin V1b receptor
Synonyms:
Avpr1b VASOPRESSIN V1B Vasopressin receptor
Type:
Enzyme Catalytic Domain
Mol. Mass.:
47104.48
Organism:
RAT
Description:
VASOPRESSIN V1B AVPR1B RAT::P48974
Residue:
425
  
Inhibitor
Name:
BDBM50299347
Synonyms:
CHEMBL576147 | N-((1-(4-chlorophenylsulfonyl)-1,2,3,4-tetrahydroquinolin-2-yl)methyl)-4-(thiophen-2-ylmethylamino)piperidine-1-carboxamide
Type:
Small organic molecule
Emp. Form.:
C27H31ClN4O3S2
Mol. Mass.:
559.143
SMILES:
Clc1ccc(cc1)S(=O)(=O)N1C(CNC(=O)N2CCC(CC2)NCc2cccs2)CCc2ccccc12
: