Target
Sodium-dependent serotonin transporter
Ligand
BDBM50299546
Substrate
Meas. Tech.
ChEMBL_591454 (CHEMBL1055306)
IC50
23.0±n/a nM
Citation
 Marquis, RWLago, AMCallahan, JFRahman, ADong, XStroup, GBHoffman, SGowen, MDelMar, EGVan Wagenen, BCLogan, SShimizu, SFox, JNemeth, EFRoethke, TSmith, BRWard, KWBhatnagar, P Antagonists of the calcium receptor. 2. Amino alcohol-based parathyroid hormone secretagogues. J Med Chem 52:6599-605 (2009)  
Target
Name:
Sodium-dependent serotonin transporter
Synonyms:
5-HT Transporter 5HTT SC6A4_HUMAN SLC6A4 Serotonin transporter (5HTT) Sodium-dependent serotonin transporter (SERT) | Solute carrier family 6 member 4
Type:
Multi-pass membrane protein
Mol. Mass.:
70322.51
Organism:
Homo sapiens (Human)
Description:
P31645
Residue:
630
  
Inhibitor
Name:
BDBM50299546
Synonyms:
3-{3-Cyano-4-[((2R)-3-{[1,1-dimethyl-2-(2-naphthalenyl)ethyl]-amino}-2-hydroxypropyl)oxy]phenyl}propanoic Acid | CHEMBL570593
Type:
Small organic molecule
Emp. Form.:
C27H30N2O4
Mol. Mass.:
446.5381
SMILES:
CC(C)(Cc1ccc2ccccc2c1)NC[C@@H](O)COc1ccc(CCC(O)=O)cc1C#N
: